experimental :: error del enlazador del sistema de archivos

Intento utilizar las nuevas características de c ++ 1z en realidad en el encabezado de desarrollo dentro de gcc 6.0.

Si pruebo este pequeño ejemplo:

#include  #include  namespace fs = std::experimental::filesystem; int main() { fs::path p1 = "/home/pete/checkit"; std::cout << "p1 = " << p1 << std::endl; } 

Tengo:

 / opt / linux-gnu_6-20151011 / bin / g ++ --std = c ++ 1z main.cpp -O2 -g -o ir
 /tmp/ccaGzqFO.o: en función \ `std :: experimental :: sistema de archivos :: v1 :: __ cxx11 :: ruta :: ruta (char const (&) [36]) ':
 /opt/linux-gnu_6-20151011/include/c++/6.0.0/experimental/bits/fs_path.h:167: referencia no definida a `std :: experimental :: sistema de archivos :: v1 :: __ cxx11 :: ruta :: _ M_split_cmpts () '
 collect2: error: ld devolvió 1 estado de salida

La versión de gcc es la instantánea linux-gnu_6-20151011

¿Alguna pista sobre cómo vincular las nuevas funciones de c ++ 1z?

El Filesystem TS no tiene nada que ver con el soporte de C ++ 1z, es una especificación completamente separada que no forma parte del borrador de trabajo de C ++ 1z. La implementación de GCC (en GCC 5.3 y posteriores) está incluso disponible en el modo C ++ 11.

Solo necesita vincular con -lstdc++fs para usarlo.

(La biblioteca relevante, libstdc++fs.a , es una biblioteca estática, por lo que, como libstdc++fs.a con cualquier biblioteca estática, debe aparecer después de los objetos que dependen de ella en el comando del enlazador).

Actualización de noviembre de 2017: además del sistema de archivos TS, el tronco GCC ahora también tiene una implementación de la biblioteca del sistema de archivos C ++ 17, definida en y en el espacio de nombres std::filesystem (NB no es “experimental” en esos nombres) cuando utilizando -std=gnu++17 o -std=c++17 . El soporte C ++ 17 de GCC aún no es completo o estable, y hasta que se considere listo para el uso en horario de máxima audiencia, también necesita vincularse a -lstdc++fs para las características del Sistema de archivos C ++ 17.

Con clang 4.0+, necesitas vincular contra libc++experimental.a

Asegúrese de comstackr con libc ++ (no libstdc ++) con -stdlib = libc ++ (como se menciona en los comentarios)

Aquí hay una demostración que podría ser útil para alguien en el futuro:

env: el6 , gcc/5.5.0

 #include  #include  #include  int main() { std::string path = std::experimental::filesystem::current_path(); std::cout << "path = " << path << std::endl; } 

Los siguientes son comstackción y prueba. Los indicadores son -std=c++17 -lstdc++fs :

 $ g++ -v Using built-in specs. COLLECT_GCC=g++ COLLECT_LTO_WRAPPER=/apps/gcc-5.5.0/bin/../libexec/gcc/x86_64-unknown-linux-gnu/5.5.0/lto-wrapper Target: x86_64-unknown-linux-gnu Configured with: ../configure --prefix=/apps/gcc-5.5.0 --disable-multilib --enable-shared --enable-threads=posix --enable-__cxa_atexit --enable-clocale=gnu --enable-languages=all Thread model: posix gcc version 5.5.0 (GCC) $ ls -lrt /apps/gcc-5.5.0/lib64 | grep libstdc -rwxr-xr-x. 1 root root 11272436 Jun 25 10:51 libstdc++.so.6.0.21 -rw-r--r--. 1 root root 2419 Jun 25 10:51 libstdc++.so.6.0.21-gdb.py -rwxr-xr-x. 1 root root 976 Jun 25 10:51 libstdc++.la -rwxr-xr-x. 1 root root 11272436 Jun 25 10:51 libstdc++.so -rw-r--r--. 1 root root 10581732 Jun 25 10:51 libstdc++fs.a -rw-r--r--. 1 root root 28985412 Jun 25 10:51 libstdc++.a -rwxr-xr-x. 1 root root 916 Jun 25 10:51 libstdc++fs.la -rwxr-xr-x. 1 root root 11272436 Jun 25 10:51 libstdc++.so.6 $ g++ filesystem-testing.cpp -lstdc++fs -std=c++17 $ ./a.out $ g++ -std=c++17 filesystem-testing.cpp -lstdc++fs $ ./a.out path = /home/userid/projects-c++/filesystem-testing 

También funciona con indicadores: -std=c++11

 $ g++ -std=c++11 filesystem-testing.cpp -lstdc++fs $ ./a.out path = /home/userid/projects-c++/filesystem-testing 

El siguiente error de comstackción _ZNSt12experimental10filesystem2v112current_pathB5cxx11Ev

 $ g++ -std=c++17 -lstdc++fs filesystem-testing.cpp /tmp/ccA6Q9oF.o: In function `main': filesystem-testing.cpp:(.text+0x11): undefined reference to `_ZNSt12experimental10filesystem2v112current_pathB5cxx11Ev' collect2: error: ld returned 1 exit status 

Si está utilizando cmake, agregue la siguiente línea a CMakeLists.txt :

 link_libraries(stdc++fs) 

Para que cmake pueda enlazar con la biblioteca correspondiente.