Articles of gradle

¿Cómo incluir una dependencia de módulo de biblioteca en un proyecto de Android Studio?

Estoy migrando un proyecto de Eclipse a AndroidStudio. Tengo un proyecto utilizado como lib en este proyecto. Esta lib se llama PullToRefresh. He intentado muchas formas de importar este proyecto a AS, pero cualquier bash lo bash. En mi proyecto tengo esta estructura de carpetas: Project Root +– app | +– builds | +– libs […]

Android: transforma las clases con Dex para depuración

Mi proyecto funcionaba bien hasta que agregué la dependencia de Facebook. Empecé a recibir este error. He leído muchas preguntas, el problema parece estar relacionado con MultiDex . Pero ninguna de las soluciones funcionó para mí Error:Execution failed for task ‘:app:transformClassesWithDexForDebug’. > com.android.build.api.transform.TransformException: com.android.ide.common.process.ProcessException: org.gradle.process.internal.ExecException: Process ‘command ‘/usr/lib/jvm/java-7-openjdk-amd64/bin/java” finished with non-zero exit value 1 Incluso […]

gradle, no se pudo expandir ZIP appcompat-v7: 19.0.1

Tengo un problema con android studio adn gradle para importar appcompat-v7. Así que aquí está mi build.gradle en el directorio src apply plugin: ‘android’ apply plugin: ‘android-apt’ def AAVersion = ‘3.0.1’ android { compileSdkVersion 19 buildToolsVersion “19.0.1” defaultConfig { minSdkVersion 10 targetSdkVersion 19 versionCode 1 versionName “1.0” packageName “com.test” } buildTypes { release { runProguard […]

Android Gradle: ¿Qué es javaMaxHeapSize “4g”?

En un proyecto android, archivo build.gradle , he pasado por esta línea dexOptions{ javaMaxHeapSize “4g” } Me gustaría saber el propósito exacto de este javaMaxHeapSize y qué significa eso 4g . ¿Qué otros valores puedo dar?

No se pudo encontrar runtime.jar (android.arch.lifecycle: runtime: 1.0.0)

Después de correr ionic cordova build android me sale este error: FAILURE: Build failed with an exception. * What went wrong: Could not resolve all files for configuration ‘:debugCompileClasspath’. > Could not find runtime.jar (android.arch.lifecycle:runtime:1.0.0). Searched in the following locations: https://jcenter.bintray.com/android/arch/lifecycle/runtime/1.0.0/runtime-1.0.0.jar Y es correcto. Cuando voy a esta URL https://jcenter.bintray.com/android/arch/lifecycle/runtime/1.0.0/runtime-1.0.0.jar aparece un 404 Not found […]

Android-Studio: Error: no se pudo crear la máquina virtual de Java

Acabo de instalar Android – estudio hoy. Primero tengo que instalar jdk7 para este IDE. Después de eso, solo pude lanzar IDE. Ahora cuando bash crear un nuevo proyecto, solo obtengo un error como se muestra en la imagen de abajo. ¿Alguien puede ayudarme? ¿Qué falta de mi lado?

Cómo ejecutar una tarea de copia con el estudio de Android en la carpeta de activos

Hasta ahora he agregado lo siguiente al final de mi “build.gradle” task copyFiles(type: Copy) copyFiles { description = ‘Copies html5 files from the common library…’ from ‘../../www’ into ‘assets/www’ include(‘**/*’) } Ahora solo necesito ayuda sobre cómo hacer que esta tarea se ejecute cada vez (antes) comstackndo la fuente de Android. Puedo ejecutar la tarea […]

Android Gradle DexException: Múltiples archivos dex definen Lorg / hamcrest / Descripción

com.android.dex.DexException: Múltiples archivos dex definen Lorg / hamcrest / Descripción que ocurre al intentar hacer una comstackción / prueba de depuración, ya sea a través de Android Studio o a través de la línea de comandos de Gradle en mi aplicación. La versión de lanzamiento (sin pruebas) funciona bien, pero tan pronto como se incluyen […]

Construcción de Cordova: por favor, instale Android: “android-22”. No quiero android-22. Quiero android-19 – ¿qué hago?

Estoy luchando con la configuración de mi teléfono y la construcción de mi primera aplicación. Creé un proyecto hello1. Agregué el proyecto de Android Plataforma Android ya agregada Ahora cuando ejecuto la comstackción de cordova, obtengo el error – Error: por favor, instala el objective de Android: “android-22″ No tengo android-22. Tengo android-19. Quiero que […]

Error de Gradle: no se pudo ejecutar la comstackción usando la distribución gradle

Después de actualizar Android Studio a la versión 0.2.7, recibí el siguiente error: org.gradle.tooling.GradleConnectionException: Could not execute build using Gradle distribution ‘http://services.gradle.org/distributions/gradle-1.6-bin.zip’.: Could not execute build using Gradle distribution ‘http://services.gradle.org/distributions/gradle-1.6-bin.zip’. Este es mi build.gradle: buildscript { repositories { mavenCentral() } dependencies { classpath ‘com.android.tools.build:gradle:0.5.+’ } } apply plugin: ‘android’ dependencies { compile files(‘libs/android-support-v4.jar’) } android […]